Reaction Details
TargetCarbonic anhydrase 14
LigandBDBM10882
Substrate/CompetitorBDBM10856
Meas. Tech.CA Inhibition Assay
Ki 25±n/a nM
Citation Winum, JYTemperini, CEl Cheikh, KInnocenti, AVullo, DCiattini, SMontero, JLScozzafava, ASupuran, CT Carbonic anhydrase inhibitors: clash with Ala65 as a means for designing inhibitors with low affinity for the ubiquitous isozyme II, exemplified by the crystal structure of the topiramate sulfamide analogue. J Med Chem49:7024-31 (2006) 
 
Carbonic anhydrase 14
Name:Carbonic anhydrase 14
Type:Enzyme
Mol. Mass.:37665.67
Organism:Homo sapiens (Human)
Description:Human (cloned) isozyme.
Residue:337
BDBM10882
BDBM10856
NameBDBM10882
Synonyms:6-ethoxy-1,3-benzothiazole-2-sulfonamide Ethamide Ethoxzolamide Ethoxzolamide, EZM US10172837, Ethoxyzolamide | sulfonamide 3
TypeSmall organic molecule
Emp. Form.C9H10N2O3S2
Mol. Mass.258.317
SMILESCCOc1ccc2nc(sc2c1)S(N)(=O)=O