Reaction Details
TargetHistamine H4 receptor
LigandBDBM335425
Substrate/Competitorn/a
Meas. Tech.Binding Assay
Ki 1.000±n/a nM
Citation Cai, HChavez, FDunford, PJGreenspan, AJMeduna, SPQuiroz, JASavall, BMTays, KLThurmond, RLWei, JWolin, RLZhang, X Diamino-pyridine, pyrimidine, and pyridazine modulators of the histamine H4 receptor US Patent US9732087 Publication Date 8/15/2017
 
Histamine H4 receptor
Name:Histamine H4 receptor
Type:G Protein-Coupled Receptor (GPCR)
Mol. Mass.:44517.02
Organism:Homo sapiens (Human)
Description:Binding assays were using CHO cells stably expressing hH4R receptors.
Residue:390
BDBM335425
NameBDBM335425
Synonyms:4-[(3R)-3-(Methylamino)pyrrolidin-1-yl]-N-[(1S,2S,3S,5R)-2,6,6-trimethylbicyclo[3.1.1]hept-3-yl]pyridin-2-amine | US9732087, 9
TypeSmall organic molecule
Emp. Form.C20H32N4
Mol. Mass.328.4949
SMILESCN[C@@H]1CCN(C1)c1ccnc(N[C@H]2C[C@H]3C[C@@H]([C@@H]2C)C3(C)C)c1