Reaction Details
TargetHistamine H4 receptor
LigandBDBM50061143
Substrate/Competitorn/a
Meas. Tech.Binding Assay
Ki 1.70±n/a nM
Citation Cai, HChavez, FDunford, PJGreenspan, AJMeduna, SPQuiroz, JASavall, BMTays, KLThurmond, RLWei, JWolin, RLZhang, X Diamino-pyridine, pyrimidine, and pyridazine modulators of the histamine H4 receptor US Patent US9732087 Publication Date 8/15/2017
 
Histamine H4 receptor
Name:Histamine H4 receptor
Type:G Protein-Coupled Receptor (GPCR)
Mol. Mass.:44517.02
Organism:Homo sapiens (Human)
Description:Binding assays were using CHO cells stably expressing hH4R receptors.
Residue:390
BDBM50061143
NameBDBM50061143
Synonyms:CHEMBL3393526 | US9732087, 22
TypeSmall organic molecule
Emp. Form.C14H24N4
Mol. Mass.248.3672
SMILESCN[C@@H]1CCN(C1)c1ccnc(NCC(C)C)c1