Reaction Details
TargetBeta-secretase 1
LigandBDBM335448
Substrate/Competitorn/a
Meas. Tech.HTRF FRET Assay
Ki 0.910±n/a nM
Citation Walsh, SPCumming, JNHe, STaoka, BMTruong, QTWu, W C2-carbocyclic iminothiazine dioxides as BACE inhibitors, compositions, and their use US Patent US9732088 Publication Date 8/15/2017
 
Beta-secretase 1
Name:Beta-secretase 1
Type:Protein
Mol. Mass.:55755.10
Organism:Homo sapiens (Human)
Description:P56817
Residue:501
BDBM335448
NameBDBM335448
Synonyms:(3R,6S)-5-amino-3-(5-((3-(but- 2-yn-1-yloxy)-1,7-naphthyridin- 8-yl)amino)-2-fluoropyridin-3- yl)-6-cyclopropyl-6- (fluoromethyl)-3-methyl-3,6- dihydro-2H-1,4-thiazine 1,1- dioxide | US9732088, Example 11
TypeSmall organic molecule
Emp. Form.C26H26F2N6O3S
Mol. Mass.540.585
SMILESCC#CCOc1cnc2c(Nc3cnc(F)c(c3)[C@]3(C)CS(=O)(=O)[C@@](CF)(C4CC4)C(N)=N3)nccc2c1