Reaction Details
TargetBeta-secretase 2
LigandBDBM335454
Substrate/Competitorn/a
Meas. Tech.BACE-2 Assay
Ki 1.10±n/a nM
Citation Walsh, SPCumming, JNHe, STaoka, BMTruong, QTWu, W C2-carbocyclic iminothiazine dioxides as BACE inhibitors, compositions, and their use US Patent US9732088 Publication Date 8/15/2017
 
Beta-secretase 2
Name:Beta-secretase 2
Type:Protein
Mol. Mass.:56171.20
Organism:Homo sapiens (Human)
Description:Q9Y5Z0
Residue:518
BDBM335454
NameBDBM335454
Synonyms:(3R,6S)-5-amino-3-(5-((2-(but- 2-yn-1-yloxy)pyrido[3,4- b]pyrazin-5-yl)amino)-2- fluoropyridin-3-yl)-6- cyclopropyl-6-(fluoromethyl)- 3-methyl-3,6-dihydro-2H-1,4- thiazine 1,1-dioxide | US9732088, Example 13
TypeSmall organic molecule
Emp. Form.C25H25F2N7O3S
Mol. Mass.541.573
SMILESCC#CCOc1cnc2c(Nc3cnc(F)c(c3)[C@]3(C)CS(=O)(=O)[C@@](CF)(C4CC4)C(N)=N3)nccc2n1