Reaction Details
TargetBeta-secretase 1
LigandBDBM335475
Substrate/Competitorn/a
Meas. Tech.HTRF FRET Assay
Ki 8.50±n/a nM
Citation Walsh, SPCumming, JNHe, STaoka, BMTruong, QTWu, W C2-carbocyclic iminothiazine dioxides as BACE inhibitors, compositions, and their use US Patent US9732088 Publication Date 8/15/2017
 
Beta-secretase 1
Name:Beta-secretase 1
Type:Protein
Mol. Mass.:55755.10
Organism:Homo sapiens (Human)
Description:P56817
Residue:501
BDBM335475
NameBDBM335475
Synonyms:(3R,6S)-5-amino-6- cyclopropyl-3-(5-fluoro-2-((7- fluoro-1,5-naphthyridin-4- yl)amino)pyridin-4-yl)-3,6- dimethyl-3,6-dihydro-2H-1,4- thiazine 1,1-dioxide | US9732088, Example 34
TypeSmall organic molecule
Emp. Form.C22H22F2N6O2S
Mol. Mass.472.511
SMILESC[C@]1(CS(=O)(=O)[C@@](C)(C2CC2)C(N)=N1)c1cc(Nc2ccnc3cc(F)cnc23)ncc1F