Reaction Details
TargetFlap endonuclease 1
LigandBDBM167148
Substrate/Competitorn/a
Meas. Tech.Binding Assay
Ki 2.50±n/a nM
Citation Eccles, WFitzgerald, AEHack, MDHawryluk, NAJones, WMKeith, JMKrawczuk, PLebsack, ADLiu, JMani, NSMcClure, KJMeduna, SPRosen, MD FLAP modulators US Patent US9732093 Publication Date 8/15/2017
 
Flap endonuclease 1
Name:Flap endonuclease 1
Type:PROTEIN
Mol. Mass.:42602.57
Organism:Homo sapiens (Human)
Description:ChEMBL_1517026
Residue:380
BDBM167148
NameBDBM167148
Synonyms:US9073876, 230 | US9732093, Compound 230
TypeSmall organic molecule
Emp. Form.C20H16FN5O
Mol. Mass.361.3723
SMILESFc1c(Oc2ncccn2)c(ccc1-c1cnc2[nH]ccc2n1)C1CCC1