Reaction Details
TargetFlap endonuclease 1
LigandBDBM167188
Substrate/Competitorn/a
Meas. Tech.Binding Assay
Ki 0.900±n/a nM
Citation Eccles, WFitzgerald, AEHack, MDHawryluk, NAJones, WMKeith, JMKrawczuk, PLebsack, ADLiu, JMani, NSMcClure, KJMeduna, SPRosen, MD FLAP modulators US Patent US9732093 Publication Date 8/15/2017
 
Flap endonuclease 1
Name:Flap endonuclease 1
Type:PROTEIN
Mol. Mass.:42602.57
Organism:Homo sapiens (Human)
Description:ChEMBL_1517026
Residue:380
BDBM167188
NameBDBM167188
Synonyms:US9073876, 269 | US9732093, Compound 269
TypeSmall organic molecule
Emp. Form.C20H21FN6O
Mol. Mass.380.4187
SMILESCNc1nc(C)cc(Oc2c(F)c(ccc2C2CCC2)-c2cnc(N)cn2)n1