Reaction Details
TargetFlap endonuclease 1
LigandBDBM167005
Substrate/Competitorn/a
Meas. Tech.Binding Assay
Ki 0.800±n/a nM
Citation Eccles, WFitzgerald, AEHack, MDHawryluk, NAJones, WMKeith, JMKrawczuk, PLebsack, ADLiu, JMani, NSMcClure, KJMeduna, SPRosen, MD FLAP modulators US Patent US9732093 Publication Date 8/15/2017
 
Flap endonuclease 1
Name:Flap endonuclease 1
Type:PROTEIN
Mol. Mass.:42602.57
Organism:Homo sapiens (Human)
Description:ChEMBL_1517026
Residue:380
BDBM167005
NameBDBM167005
Synonyms:US9073876, 91 | US9732093, Compound 91
TypeSmall organic molecule
Emp. Form.C22H18FN5OS
Mol. Mass.419.475
SMILESNc1cnc(cn1)-c1ccc(C2CCC2)c(Oc2nccc(n2)-c2cccs2)c1F