Reaction Details
TargetFlap endonuclease 1
LigandBDBM167024
Substrate/Competitorn/a
Meas. Tech.Binding Assay
Ki 2.60±n/a nM
Citation Eccles, WFitzgerald, AEHack, MDHawryluk, NAJones, WMKeith, JMKrawczuk, PLebsack, ADLiu, JMani, NSMcClure, KJMeduna, SPRosen, MD FLAP modulators US Patent US9732093 Publication Date 8/15/2017
 
Flap endonuclease 1
Name:Flap endonuclease 1
Type:PROTEIN
Mol. Mass.:42602.57
Organism:Homo sapiens (Human)
Description:ChEMBL_1517026
Residue:380
BDBM167024
NameBDBM167024
Synonyms:US9073876, 110 | US9732093, Compound 110
TypeSmall organic molecule
Emp. Form.C20H16FN5O
Mol. Mass.361.3723
SMILESNc1cnc(cn1)-c1ccc(C2CCC2)c(Oc2ncccc2C#N)c1F