Reaction Details
TargetFlap endonuclease 1
LigandBDBM167083
Substrate/Competitorn/a
Meas. Tech.Binding Assay
Ki 2.80±n/a nM
Citation Eccles, WFitzgerald, AEHack, MDHawryluk, NAJones, WMKeith, JMKrawczuk, PLebsack, ADLiu, JMani, NSMcClure, KJMeduna, SPRosen, MD FLAP modulators US Patent US9732093 Publication Date 8/15/2017
 
Flap endonuclease 1
Name:Flap endonuclease 1
Type:PROTEIN
Mol. Mass.:42602.57
Organism:Homo sapiens (Human)
Description:ChEMBL_1517026
Residue:380
BDBM167083
NameBDBM167083
Synonyms:US9073876, 168 | US9732093, Compound 168
TypeSmall organic molecule
Emp. Form.C21H23FN6O
Mol. Mass.394.4453
SMILESCC(C)c1cc(Oc2c(F)c(ccc2C2CCC2)-c2cnc(N)nc2)nc(N)n1