Reaction Details
TargetCarbonic anhydrase 2
LigandBDBM13073
Substrate/CompetitorBDBM11326
Meas. Tech.Carbonic Anhydrase Enzyme Inhibition Assay
pH7.4±n/a
Temperature298.15±n/a K
IC50 0.62±n/a nM
Citation Gruneberg, SStubbs, MTKlebe, G Successful virtual screening for novel inhibitors of human carbonic anhydrase: strategy and experimental confirmation. J Med Chem45:3588-602 (2002) 
 
Carbonic anhydrase 2
Name:Carbonic anhydrase 2
Type:Enzyme
Mol. Mass.:29250.71
Organism:Homo sapiens (Human)
Description:P00918
Residue:260
BDBM13073
BDBM11326
NameBDBM13073
Synonyms:2000-07790 LeadQuest Compound 7
TypeSmall organic molecule
Emp. Form.C10H11N3O5S
Mol. Mass.285.276
SMILESNS(=O)(=O)c1ccc(N2CCCC2=O)c(c1)[N+]([O-])=O