Reaction Details
TargetRAF proto-oncogene serine/threonine-protein kinase
LigandBDBM200525
Substrate/Competitorn/a
Meas. Tech.TBD
IC50 0.640±n/a nM
Citation Zhou, CZhang, G Fused tricyclic amide compounds as multiple kinase inhibitors US Patent US9670231 Publication Date 6/6/2017
 
RAF proto-oncogene serine/threonine-protein kinase
Name:RAF proto-oncogene serine/threonine-protein kinase
Type:Serine/threonine-protein kinase
Mol. Mass.:73082.52
Organism:Homo sapiens (Human)
Description:P04049
Residue:648
BDBM200525
NameBDBM200525
Synonyms:US9670231, 1.40
TypeSmall organic molecule
Emp. Form.C25H18F3N3O4
Mol. Mass.481.4233
SMILESFC(F)(F)c1ccc(cc1)C(=O)N[C@@H]1[C@H]2Oc3ccc(Oc4ccnc5NC(=O)CCc45)cc3[C@@H]12