Reaction Details
TargetCoagulation factor X
LigandBDBM13305
Substrate/CompetitorBDBM12593
Meas. Tech.Enzyme Assay and Determination of the Inhibition Constants.
Ki 7.0±n/a nM
Citation Choi-Sledeski, YMMcGarry, DGGreen, DMMason, HJBecker, MRDavis, RSEwing, WRDankulich, WPManetta, VEMorris, RLSpada, APCheney, DLBrown, KDColussi, DJChu, VHeran, CLMorgan, SRBentley, RGLeadley, RJMaignan, SGuilloteau, JPDunwiddie, CTPauls, HW Sulfonamidopyrrolidinone factor Xa inhibitors: potency and selectivity enhancements via P-1 and P-4 optimization. J Med Chem42:3572-87 (1999) 
 
Coagulation factor X
Name:Coagulation factor X
Type:Enzyme
Mol. Mass.:54726.60
Organism:Homo sapiens (Human)
Description:n/a
Residue:488
BDBM13305
BDBM12593
NameBDBM13305
Synonyms:4-Amino-3-[3-(S)-(5-isoxazol-3-ylthiophene-2-ylsulfonylamino)-2-oxopyrrolidin-1-ylmethyl]benzamidine Sulfonamidopyrrolidinone 4d
TypeSmall organic molecule
Emp. Form.C19H20N6O4S2
Mol. Mass.460.53
SMILESNC(=N)c1ccc(N)c(CN2CC[C@H](NS(=O)(=O)c3ccc(s3)-c3ccon3)C2=O)c1