Reaction Details
TargetCatenin beta-1 [138-686]
LigandBDBM213767
Substrate/Competitorn/a
Meas. Tech.AlphaScreen Assay
Ki 16570±730 nM
Citation Ji, HYu, BZhang, MGuo, W Substituted 1H-indazol-1-OL analogs as inhibitors of beta catenin/Tcf protein-protein interactions US Patent US9738628 Publication Date 8/22/2017
 
Catenin beta-1 [138-686]
Name:Catenin beta-1 [138-686]
Type:Protein
Mol. Mass.:60127.24
Organism:Homo sapiens (Human)
Description:aa 138-686
Residue:549
BDBM213767
NameBDBM213767
Synonyms:US9284299, 18 | US9738628, Compound 18
TypeSmall organic molecule
Emp. Form.C15H14N8O3
Mol. Mass.354.3235
SMILESCc1noc(C)c1C(=O)N(Cc1nn[nH]n1)c1ccc2n(O)ncc2c1