Reaction Details
TargetHistone-lysine N-methyltransferase EZH2
LigandBDBM335708
Substrate/Competitorn/a
Meas. Tech.Histone Methyl Transferase Assay
EC50<5000±n/a nM
Citation Kim, KSZhang, LPurandare, AVSeitz, SP Inhibitors of lysine methyl transferase US Patent US9738630 Publication Date 8/22/2017
 
Histone-lysine N-methyltransferase EZH2
Name:Histone-lysine N-methyltransferase EZH2
Type:Protein
Mol. Mass.:85367.84
Organism:Homo sapiens (Human)
Description:Q15910
Residue:746
BDBM335708
NameBDBM335708
Synonyms:5-(Ethyl(tetrahydro-2H-pyran-4- yl)amino)-N-((6-methoxy-1- methyl-3-oxo-2,3- dihydroisoquinolin-4-yl)methyl)- 4-methyl-4'-(morpholinomethyl)- [1,1'-biphenyl]-3-carboxamide | US9738630, Example 4
TypeSmall organic molecule
Emp. Form.C38H46N4O5
Mol. Mass.638.7956
SMILESCCN(C1CCOCC1)c1cc(cc(C(=O)NCc2c3cc(OC)ccc3c(C)[nH]c2=O)c1C)-c1ccc(CN2CCOCC2)cc1