Reaction Details
TargetHistamine receptor H3
LigandBDBM200822
Substrate/Competitorn/a
Meas. Tech.Radioligand binding assay
Ki 267±0 nM
Citation Gao, ZHall, DStefany, D Substituted N-heteroaryl spirolactam bipyrrolidines, preparation and therapeutic use thereof US Patent US9533995 Publication Date 1/3/2017
 
Histamine receptor H3
Name:Histamine receptor H3
Synonyms:n/a
Type:Enzyme
Mol. Mass.:48611.84
Organism:Macaca mulatta (Rhesus macaque)
Description:Q865E1
Residue:445
BDBM200822
NameBDBM200822
TypeSmall organic molecule
Emp. Form.C24H36N4O2
Mol. Mass.412.5682
SMILESC[C@H]1CCCN1[C@@H]1CCN(C1)c1ccc(N2CCC3(CCC(O)CC3)C2=O)c(C)n1