Reaction Details
TargetHistamine receptor H3
LigandBDBM200834
Substrate/Competitorn/a
Meas. Tech.Radioligand binding assay
Ki 105±0 nM
Citation Gao, ZHall, DStefany, D Substituted N-heteroaryl spirolactam bipyrrolidines, preparation and therapeutic use thereof US Patent US9533995 Publication Date 1/3/2017
 
Histamine receptor H3
Name:Histamine receptor H3
Synonyms:n/a
Type:Enzyme
Mol. Mass.:48611.84
Organism:Macaca mulatta (Rhesus macaque)
Description:Q865E1
Residue:445
BDBM200834
NameBDBM200834
TypeSmall organic molecule
Emp. Form.C26H40N6O3
Mol. Mass.484.6342
SMILESC[C@H]1CCCN1[C@H]1CCN(C1)c1cnc(cn1)N1CCC2(CCN(CC2)C(=O)OC(C)(C)C)C1=O