Reaction Details
TargetPlasma kallikrein
LigandBDBM335785
Substrate/Competitorn/a
Meas. Tech.Enzyme Inhibition Assay
Ki 2.81±n/a nM
Citation Pinto, DJClarke, CGSmith, II, LMOrwat, MJJeon, YCorte, JR Tetrahydroisoquinolines containing substituted azoles as factor XIa inhibitors US Patent US9738655 Publication Date 8/22/2017
 
Plasma kallikrein
Name:Plasma kallikrein
Type:Protein
Mol. Mass.:71391.16
Organism:Homo sapiens (Human)
Description:P03952
Residue:638
BDBM335785
NameBDBM335785
Synonyms:4-(2-(1-(3-chloro-2- fluorophenyl)-1H-1,2,3- triazole-4-carbonyl)- 1,1',2,2',3,3',4,4'- octahydro-[5,6'- biisoquinoline]-1- carboxamido)benzoic acid, TFA salt | US9738655, Example 40
TypeSmall organic molecule
Emp. Form.C37H32ClFN4O5
Mol. Mass.667.125
SMILESCOC(=O)c1ccc(NC(=O)[C@@H]2N(CCc3c2cccc3-c2ccc3CNCCc3c2)C(=O)[C@H]2CC(=NO2)c2cccc(Cl)c2F)cc1