Reaction Details
TargetPlasma kallikrein
LigandBDBM335870
Substrate/Competitorn/a
Meas. Tech.Enzyme Inhibition Assay
Ki 1.75±n/a nM
Citation Pinto, DJClarke, CGSmith, II, LMOrwat, MJJeon, YCorte, JR Tetrahydroisoquinolines containing substituted azoles as factor XIa inhibitors US Patent US9738655 Publication Date 8/22/2017
 
Plasma kallikrein
Name:Plasma kallikrein
Type:Protein
Mol. Mass.:71391.16
Organism:Homo sapiens (Human)
Description:P03952
Residue:638
BDBM335870
NameBDBM335870
Synonyms:(S)-N-(4-Carbamoylphenyl)-2-(1-(3-chloro-2-fluorophenyl)-1H-1,2,3-triazole-4-carbonyl)-5-(4-(dimethylamino)piperidin-1-yl)-1,2,3,4-tetrahydroisoquinoline-1-carboxamide, bis-TFA salt | US9738655, Example 101
TypeSmall organic molecule
Emp. Form.C33H34ClFN8O3
Mol. Mass.645.126
SMILESCN(C)C1CCN(CC1)c1cccc2[C@H](N(CCc12)C(=O)c1cn(nn1)-c1cccc(Cl)c1F)C(=O)Nc1ccc(cc1)C(N)=O