Reaction Details
TargetPlasma kallikrein
LigandBDBM335990
Substrate/Competitorn/a
Meas. Tech.Enzyme Inhibition Assay
Ki 3.12±n/a nM
Citation Pinto, DJClarke, CGSmith, II, LMOrwat, MJJeon, YCorte, JR Tetrahydroisoquinolines containing substituted azoles as factor XIa inhibitors US Patent US9738655 Publication Date 8/22/2017
 
Plasma kallikrein
Name:Plasma kallikrein
Type:Protein
Mol. Mass.:71391.16
Organism:Homo sapiens (Human)
Description:P03952
Residue:638
BDBM335990
NameBDBM335990
Synonyms:4-(2-(3-(3-chlorophenyl)- 4,5-dihydroisoxazole-5- carbonyl)-5-(4- methylpiperazin-1-yl)- 1,2,3,4- tetrahydroisoquinoline-1- carboxamido)benzoic acid, 2 TFA salt US9738655, Example 217
TypeSmall organic molecule
Emp. Form.C32H32ClN5O5
Mol. Mass.602.08
SMILESCN1CCN(CC1)c1cccc2C(N(CCc12)C(=O)C1CC(=NO1)c1cccc(Cl)c1)C(=O)Nc1ccc(cc1)C(O)=O