Reaction Details
TargetPlasma kallikrein
LigandBDBM336054
Substrate/Competitorn/a
Meas. Tech.Enzyme Inhibition Assay
Ki 1.98±n/a nM
Citation Pinto, DJClarke, CGSmith, II, LMOrwat, MJJeon, YCorte, JR Tetrahydroisoquinolines containing substituted azoles as factor XIa inhibitors US Patent US9738655 Publication Date 8/22/2017
 
Plasma kallikrein
Name:Plasma kallikrein
Type:Protein
Mol. Mass.:71391.16
Organism:Homo sapiens (Human)
Description:P03952
Residue:638
BDBM336054
NameBDBM336054
Synonyms:4-(2-(3-(3-chloro-2- fluorophenyl)-4,5- dihydroisoxazole-5-carbonyl)-5- (4-(dimethylcarbamoyl) piperidin-1-yl)-1,2,3,4- tetrahydroisoquinoline-1- carboxamido)benzoic acid, TFA salt US9738655, Example 279
TypeSmall organic molecule
Emp. Form.C35H35ClFN5O6
Mol. Mass.676.134
SMILESCN(C)C(=O)C1CCN(CC1)c1cccc2C(N(CCc12)C(=O)C1CC(=NO1)c1cccc(Cl)c1F)C(=O)Nc1ccc(cc1)C(O)=O