Reaction Details
TargetcGMP-dependent protein kinase 2
LigandBDBM65502
Substrate/Competitorn/a
Meas. Tech.Microfluidic Mobility-Shift Assay
pH7±n/a
EC50 58±5.0 nM
Commentsextracted
Citation Campbell, JCHenning, PFranz, ESankaran, BHerberg, FWKim, C Structural Basis of Analog Specificity in PKG I and II. ACS Chem Biol12:2388-2398 (2017) 
 
cGMP-dependent protein kinase 2
Name:cGMP-dependent protein kinase 2
Type:PROTEIN
Mol. Mass.:87448.25
Organism:Homo sapiens (Human)
Description:ChEMBL_774533
Residue:762
BDBM65502
NameBDBM65502
Synonyms:2-amino-8-bromo-9-[(2R,4aR,6R,7R,7aS)-2,7-dihydroxy-2-oxotetrahydro-2H,4H-2lambda~5~-furo[3,2-d][1,3,2]dioxaphosphinin-6-yl]-1,9-dihydro-6H-purin-6-one | 8-Br-cGMP
TypeSmall organic molecule
Emp. Form.C10H11BrN5O7P
Mol. Mass.424.101
SMILESNc1nc2n([C@@H]3O[C@@H]4COP(O)(=O)O[C@H]4[C@H]3O)c(Br)nc2c(=O)[nH]1