Reaction Details
TargetIntermediate conductance calcium-activated potassium channel protein 4
LigandBDBM50019906
Substrate/Competitorn/a
Meas. Tech.KCa3.1 Assay
IC50 66±0 nM
Citation Burke, MJMcKibben, BTschantz, MA Fused thiazin-3-ones as KCA3.1 inhibitors US Patent US9533999 Publication Date 1/3/2017
 
Intermediate conductance calcium-activated potassium channel protein 4
Name:Intermediate conductance calcium-activated potassium channel protein 4
Type:PROTEIN
Mol. Mass.:47723.22
Organism:Homo sapiens (Human)
Description:ChEMBL_1361891
Residue:427
BDBM50019906
NameBDBM50019906
Synonyms:CHEMBL3287211 | US9533999, ii-11
TypeSmall organic molecule
Emp. Form.C16H12ClF3N2O2S
Mol. Mass.388.792
SMILESOCc1ccc2SCC(=O)N(Cc3ccc(Cl)c(c3)C(F)(F)F)c2n1