Reaction Details
TargetTyrosine-protein kinase ABL1 [201-500,T315N]
LigandBDBM13530
Substrate/CompetitorBDBM13531
Meas. Tech.Kinase Assay and Binding Constant Measurement
Kd>10000±n/a nM
Citation Carter, TAWodicka, LMShah, NPVelasco, AMFabian, MATreiber, DKMilanov, ZVAtteridge, CEBiggs, WHEdeen, PTFloyd, MFord, JMGrotzfeld, RMHerrgard, SInsko, DEMehta, SAPatel, HKPao, WSawyers, CLVarmus, HZarrinkar, PPLockhart, DJ Inhibition of drug-resistant mutants of ABL, KIT, and EGF receptor kinases. Proc Natl Acad Sci U S A102:11011-6 (2005) 
 
Tyrosine-protein kinase ABL1 [201-500,T315N]
Name:Tyrosine-protein kinase ABL1 [201-500,T315N]
Type:Enzyme
Mol. Mass.:34608.76
Organism:Homo sapiens (Human)
Description:P00519[201-500,T315N]
Residue:300
BDBM13530
BDBM13531
NameBDBM13530
Synonyms:4-[(4-methylpiperazin-1-yl)methyl]-N-[4-methyl-3-[(4-pyridin-3-ylpyrimidin-2-yl)amino]phenyl]benzamide Gleevec Imatinib, 21 STI-571 US10906896, Cpd imatinib US11725005, Compound imatinib cid_5291 med.21724, Compound 6
TypeSmall organic molecule
Emp. Form.C29H31N7O
Mol. Mass.493.6027
SMILESCN1CCN(Cc2ccc(cc2)C(=O)Nc2ccc(C)c(Nc3nccc(n3)-c3cccnc3)c2)CC1