Reaction Details
TargetTyrosine-protein kinase ABL1 [201-500,T315I]
LigandBDBM13216
Substrate/CompetitorBDBM13531
Meas. Tech.Kinase Assay and Binding Constant Measurement
Kd 600±n/a nM
Citation Carter, TAWodicka, LMShah, NPVelasco, AMFabian, MATreiber, DKMilanov, ZVAtteridge, CEBiggs, WHEdeen, PTFloyd, MFord, JMGrotzfeld, RMHerrgard, SInsko, DEMehta, SAPatel, HKPao, WSawyers, CLVarmus, HZarrinkar, PPLockhart, DJ Inhibition of drug-resistant mutants of ABL, KIT, and EGF receptor kinases. Proc Natl Acad Sci U S A102:11011-6 (2005) 
 
Tyrosine-protein kinase ABL1 [201-500,T315I]
Name:Tyrosine-protein kinase ABL1 [201-500,T315I]
Type:Enzyme
Mol. Mass.:34607.81
Organism:Homo sapiens (Human)
Description:P00519[201-500,T315I]
Residue:300
BDBM13216
BDBM13531
NameBDBM13216
Synonyms:BMS-354825 DASATINIB N-(2-chloro-6-methylphenyl)-2-({6-[4-(2-hydroxyethyl)piperazin-1-yl]-2-methylpyrimidin-4-yl}amino)-1,3-thiazole-5-carboxamide US20230348453, Compound A8 med.21724, Compound Dasatinib
TypeSmall organic molecule
Emp. Form.C22H26ClN7O2S
Mol. Mass.488.006
SMILESCc1nc(Nc2ncc(s2)C(=O)Nc2c(C)cccc2Cl)cc(n1)N1CCN(CCO)CC1