Reaction Details
TargetTyrosine-protein kinase ABL1 [201-500,F359V]
LigandBDBM13533
Substrate/CompetitorBDBM13531
Meas. Tech.Kinase Assay and Binding Constant Measurement
Kd 8000±n/a nM
Citation Carter, TAWodicka, LMShah, NPVelasco, AMFabian, MATreiber, DKMilanov, ZVAtteridge, CEBiggs, WHEdeen, PTFloyd, MFord, JMGrotzfeld, RMHerrgard, SInsko, DEMehta, SAPatel, HKPao, WSawyers, CLVarmus, HZarrinkar, PPLockhart, DJ Inhibition of drug-resistant mutants of ABL, KIT, and EGF receptor kinases. Proc Natl Acad Sci U S A102:11011-6 (2005) 
 
Tyrosine-protein kinase ABL1 [201-500,F359V]
Name:Tyrosine-protein kinase ABL1 [201-500,F359V]
Type:Enzyme
Mol. Mass.:34547.72
Organism:Homo sapiens (Human)
Description:P00519[201-500,F359V]
Residue:300
BDBM13533
BDBM13531
NameBDBM13533
Synonyms:1-[2-(4-methylphenyl)-5-tert-butyl-pyrazol-3-yl]-3-[4-(2-morpholin-4-ylethoxy)naphthalen-1-yl]urea 1-[5-tert-butyl-2-(4-methylphenyl)pyrazol-3-yl]-3-[4-(2-morpholin-4-ylethoxy)naphthalen-1-yl]urea 3-[2-(4-methylphenyl)-5-tert-butyl-pyrazol-3-yl]-1-[4-(2-morpholin-4-ylethoxy)naphthalen-1-yl]urea BIRB 796 BIRB-796, 3 D3RKN_73 US11407771, Compound 43 US9187470, 43 (BIRB-796) US9260410, BIRB796 diaryl urea compound 10
TypeSmall organic molecule
Emp. Form.C31H37N5O3
Mol. Mass.527.6572
SMILESCc1ccc(cc1)-n1nc(cc1NC(=O)Nc1ccc(OCCN2CCOCC2)c2ccccc12)C(C)(C)C