Reaction Details
TargetTyrosine-protein kinase ABL1 [201-500,H396P]
LigandBDBM6572
Substrate/CompetitorBDBM13531
Meas. Tech.Kinase Assay and Binding Constant Measurement
Kd 1±n/a nM
Citation Carter, TAWodicka, LMShah, NPVelasco, AMFabian, MATreiber, DKMilanov, ZVAtteridge, CEBiggs, WHEdeen, PTFloyd, MFord, JMGrotzfeld, RMHerrgard, SInsko, DEMehta, SAPatel, HKPao, WSawyers, CLVarmus, HZarrinkar, PPLockhart, DJ Inhibition of drug-resistant mutants of ABL, KIT, and EGF receptor kinases. Proc Natl Acad Sci U S A102:11011-6 (2005) 
 
Tyrosine-protein kinase ABL1 [201-500,H396P]
Name:Tyrosine-protein kinase ABL1 [201-500,H396P]
Type:Enzyme
Mol. Mass.:34555.23
Organism:Homo sapiens (Human)
Description:P00519[201-500,H396P]
Residue:300
BDBM6572
BDBM13531
NameBDBM6572
Synonyms:6-(2,6-dichlorophenyl)-2-[(4-fluoro-3-methylphenyl)amino]-8-methyl-7H,8H-pyrido[2,3-d]pyrimidin-7-one PD-180970 | PD180970
TypeSmall organic molecule
Emp. Form.C21H15Cl2FN4O
Mol. Mass.429.274
SMILESCc1cc(Nc2ncc3cc(-c4c(Cl)cccc4Cl)c(=O)n(C)c3n2)ccc1F