Reaction Details
TargetTyrosine-protein kinase ABL1 [201-500,T315I]
LigandBDBM13535
Substrate/CompetitorBDBM13531
Meas. Tech.Kinase Assay and Binding Constant Measurement
Kd>10000±n/a nM
Citation Carter, TAWodicka, LMShah, NPVelasco, AMFabian, MATreiber, DKMilanov, ZVAtteridge, CEBiggs, WHEdeen, PTFloyd, MFord, JMGrotzfeld, RMHerrgard, SInsko, DEMehta, SAPatel, HKPao, WSawyers, CLVarmus, HZarrinkar, PPLockhart, DJ Inhibition of drug-resistant mutants of ABL, KIT, and EGF receptor kinases. Proc Natl Acad Sci U S A102:11011-6 (2005) 
 
Tyrosine-protein kinase ABL1 [201-500,T315I]
Name:Tyrosine-protein kinase ABL1 [201-500,T315I]
Type:Enzyme
Mol. Mass.:34607.81
Organism:Homo sapiens (Human)
Description:P00519[201-500,T315I]
Residue:300
BDBM13535
BDBM13531
NameBDBM13535
Synonyms:4-[6-methoxy-7-(3-piperidin-1-ylpropoxy)quinazolin-4-yl]-N-(4-propan-2-yloxyphenyl)piperazine-1-carboxamide 4-[6-methoxy-7-[3-(1-piperidinyl)propoxy]-4-quinazolinyl]-N-(4-propan-2-yloxyphenyl)-1-piperazinecarboxamide CHEMBL124660 MLN518 cid_3038522
TypeSmall organic molecule
Emp. Form.C31H42N6O4
Mol. Mass.562.703
SMILESCOc1cc2c(ncnc2cc1OCCCN1CCCCC1)N1CCN(CC1)C(=O)Nc1ccc(OC(C)C)cc1