Reaction Details
TargetKallikrein-7
LigandBDBM336129
Substrate/Competitorn/a
Meas. Tech.Inhibition Assay
IC50 80.0±n/a nM
Citation Linschoten, M Kallikrein 7 inhibitors US Patent US9744148 Publication Date 8/29/2017
 
Kallikrein-7
Name:Kallikrein-7
Type:PROTEIN
Mol. Mass.:27535.05
Organism:Homo sapiens (Human)
Description:ChEMBL_1469257
Residue:253
BDBM336129
NameBDBM336129
Synonyms:US9744148, 3
TypeSmall organic molecule
Emp. Form.C16H17ClN2O4
Mol. Mass.336.77
SMILESCCC(OC(=O)Cc1ccc(Cl)cc1)C(=O)Nc1cc(C)on1