Reaction Details
TargetKallikrein-7
LigandBDBM336132
Substrate/Competitorn/a
Meas. Tech.Inhibition Assay
IC50 90.0±n/a nM
Citation Linschoten, M Kallikrein 7 inhibitors US Patent US9744148 Publication Date 8/29/2017
 
Kallikrein-7
Name:Kallikrein-7
Type:PROTEIN
Mol. Mass.:27535.05
Organism:Homo sapiens (Human)
Description:ChEMBL_1469257
Residue:253
BDBM336132
NameBDBM336132
Synonyms:US9744148, 5
TypeSmall organic molecule
Emp. Form.C17H16ClNO3
Mol. Mass.317.767
SMILESCC(OC(=O)Cc1ccc(Cl)cc1)C(=O)Nc1ccccc1