Reaction Details
TargetKallikrein-7
LigandBDBM336134
Substrate/Competitorn/a
Meas. Tech.Inhibition Assay
IC50 130±n/a nM
Citation Linschoten, M Kallikrein 7 inhibitors US Patent US9744148 Publication Date 8/29/2017
 
Kallikrein-7
Name:Kallikrein-7
Type:PROTEIN
Mol. Mass.:27535.05
Organism:Homo sapiens (Human)
Description:ChEMBL_1469257
Residue:253
BDBM336134
NameBDBM336134
Synonyms:US9744148, 7
TypeSmall organic molecule
Emp. Form.C16H18N2O5
Mol. Mass.318.3245
SMILESCOc1ccc(CC(=O)OC(C)C(=O)Nc2cc(C)on2)cc1