Reaction Details
TargetKallikrein-7
LigandBDBM336147
Substrate/Competitorn/a
Meas. Tech.Inhibition Assay
IC50 190±n/a nM
Citation Linschoten, M Kallikrein 7 inhibitors US Patent US9744148 Publication Date 8/29/2017
 
Kallikrein-7
Name:Kallikrein-7
Type:PROTEIN
Mol. Mass.:27535.05
Organism:Homo sapiens (Human)
Description:ChEMBL_1469257
Residue:253
BDBM336147
NameBDBM336147
Synonyms:US9744148, 16
TypeSmall organic molecule
Emp. Form.C16H24N2O4
Mol. Mass.308.3728
SMILESCCC(OC(=O)CCC1CCCC1)C(=O)Nc1cc(C)on1