Reaction Details
TargetKallikrein-7
LigandBDBM336149
Substrate/Competitorn/a
Meas. Tech.Inhibition Assay
IC50 220±n/a nM
Citation Linschoten, M Kallikrein 7 inhibitors US Patent US9744148 Publication Date 8/29/2017
 
Kallikrein-7
Name:Kallikrein-7
Type:PROTEIN
Mol. Mass.:27535.05
Organism:Homo sapiens (Human)
Description:ChEMBL_1469257
Residue:253
BDBM336149
NameBDBM336149
Synonyms:US9744148, 18
TypeSmall organic molecule
Emp. Form.C23H24N2O4
Mol. Mass.392.4477
SMILESCCCC(OC(=O)C(c1ccccc1)c1ccccc1)C(=O)Nc1cc(C)on1