Reaction Details
TargetKallikrein-7
LigandBDBM336142
Substrate/Competitorn/a
Meas. Tech.Inhibition Assay
IC50 270±n/a nM
Citation Linschoten, M Kallikrein 7 inhibitors US Patent US9744148 Publication Date 8/29/2017
 
Kallikrein-7
Name:Kallikrein-7
Type:PROTEIN
Mol. Mass.:27535.05
Organism:Homo sapiens (Human)
Description:ChEMBL_1469257
Residue:253
BDBM336142
NameBDBM336142
Synonyms:US9744148, 12 | US9744148, 23
TypeSmall organic molecule
Emp. Form.C17H20N2O5
Mol. Mass.332.3511
SMILESCCC(OC(=O)Cc1ccc(OC)cc1)C(=O)Nc1cc(C)on1