Reaction Details
TargetKallikrein-7
LigandBDBM336157
Substrate/Competitorn/a
Meas. Tech.Inhibition Assay
IC50 320±n/a nM
Citation Linschoten, M Kallikrein 7 inhibitors US Patent US9744148 Publication Date 8/29/2017
 
Kallikrein-7
Name:Kallikrein-7
Type:PROTEIN
Mol. Mass.:27535.05
Organism:Homo sapiens (Human)
Description:ChEMBL_1469257
Residue:253
BDBM336157
NameBDBM336157
Synonyms:US9744148, 26
TypeSmall organic molecule
Emp. Form.C17H18N2O6
Mol. Mass.346.3346
SMILESCCC(OC(=O)Cc1ccc2OCOc2c1)C(=O)Nc1cc(C)on1