Reaction Details
TargetKallikrein-7
LigandBDBM336160
Substrate/Competitorn/a
Meas. Tech.Inhibition Assay
IC50 350±n/a nM
Citation Linschoten, M Kallikrein 7 inhibitors US Patent US9744148 Publication Date 8/29/2017
 
Kallikrein-7
Name:Kallikrein-7
Type:PROTEIN
Mol. Mass.:27535.05
Organism:Homo sapiens (Human)
Description:ChEMBL_1469257
Residue:253
BDBM336160
NameBDBM336160
Synonyms:US9744148, 29
TypeSmall organic molecule
Emp. Form.C22H17ClFNO3
Mol. Mass.397.827
SMILESFc1ccc(NC(=O)C(OC(=O)Cc2ccc(Cl)cc2)c2ccccc2)cc1