Reaction Details
TargetKallikrein-7
LigandBDBM336166
Substrate/Competitorn/a
Meas. Tech.Inhibition Assay
IC50 410±n/a nM
Citation Linschoten, M Kallikrein 7 inhibitors US Patent US9744148 Publication Date 8/29/2017
 
Kallikrein-7
Name:Kallikrein-7
Type:PROTEIN
Mol. Mass.:27535.05
Organism:Homo sapiens (Human)
Description:ChEMBL_1469257
Residue:253
BDBM336166
NameBDBM336166
Synonyms:US9744148, 35
TypeSmall organic molecule
Emp. Form.C24H23NO5
Mol. Mass.405.4431
SMILESCOc1ccc(CC(=O)OC(C(=O)Nc2ccc(OC)cc2)c2ccccc2)cc1