Reaction Details
TargetKallikrein-7
LigandBDBM336167
Substrate/Competitorn/a
Meas. Tech.Inhibition Assay
IC50 430±n/a nM
Citation Linschoten, M Kallikrein 7 inhibitors US Patent US9744148 Publication Date 8/29/2017
 
Kallikrein-7
Name:Kallikrein-7
Type:PROTEIN
Mol. Mass.:27535.05
Organism:Homo sapiens (Human)
Description:ChEMBL_1469257
Residue:253
BDBM336167
NameBDBM336167
Synonyms:US9744148, 36
TypeSmall organic molecule
Emp. Form.C21H20N2O5
Mol. Mass.380.3939
SMILESCOc1ccc(CC(=O)OC(C(=O)Nc2cc(C)on2)c2ccccc2)cc1