Reaction Details
TargetBeta-secretase 1
LigandBDBM336255
Substrate/Competitorn/a
Meas. Tech.Cell-Free Assay
IC50 7.00±n/a nM
Citation Brodney, MABeck, EMButler, CRZhang, LO Neill, BTBarreiro, GLaChapelle, EARogers, BN 2-amino 6-methyl-4,4a,5,6-tetrahydropyrano[3,4-d][1,3]thiazin-8a(8H)-yl-1,3-thiazol-4-yl amides US Patent US9744173 Publication Date 8/29/2017
 
Beta-secretase 1
Name:Beta-secretase 1
Type:Protein
Mol. Mass.:55755.10
Organism:Homo sapiens (Human)
Description:P56817
Residue:501
BDBM336255
NameBDBM336255
Synonyms:N-{2-[(4aR,6S,8aR)-2-Amino-6-methyl-4,4a,5,6-tetrahydropyrano[3,4-d][1,3]thiazin-8a(8H)-yl]-1,3-thiazol-4-yl}-2-(fluoromethyl)-1,3-oxazole-4-carboxamide | US9744173, Example 3
TypeSmall organic molecule
Emp. Form.C23H22FN5O4S2
Mol. Mass.515.58
SMILESC[C@H]1C[C@H]2CSC(NC(=O)c3ccccc3)=N[C@]2(CO1)c1nc(NC(=O)c2coc(CF)n2)cs1