Reaction Details
TargetBeta-secretase 1
LigandBDBM336258
Substrate/Competitorn/a
Meas. Tech.Cell-Free Assay
IC50 4.00±n/a nM
Citation Brodney, MABeck, EMButler, CRZhang, LO Neill, BTBarreiro, GLaChapelle, EARogers, BN 2-amino 6-methyl-4,4a,5,6-tetrahydropyrano[3,4-d][1,3]thiazin-8a(8H)-yl-1,3-thiazol-4-yl amides US Patent US9744173 Publication Date 8/29/2017
 
Beta-secretase 1
Name:Beta-secretase 1
Type:Protein
Mol. Mass.:55755.10
Organism:Homo sapiens (Human)
Description:P56817
Residue:501
BDBM336258
NameBDBM336258
Synonyms:N-{2-[(4aR,6S,8aR)-2-Amino-6-methyl-4,4a,5,6-tetrahydropyrano[3,4-d][1,3]thiazin-8a(8H)-yl]-1,3-thiazol-4-yl}-4-chloro-1-(difluoromethyl)-1H-pyrazole-3-carboxamide | US9744173, Example 6
TypeSmall organic molecule
Emp. Form.C23H21ClF2N6O3S2
Mol. Mass.567.031
SMILESC[C@H]1C[C@H]2CSC(NC(=O)c3ccccc3)=N[C@]2(CO1)c1nc(NC(=O)c2nn(cc2Cl)C(F)F)cs1