Reaction Details
TargetBeta-secretase 1
LigandBDBM223384
Substrate/Competitorn/a
Meas. Tech.Cell-Free Assay
IC50 25.0±n/a nM
Citation Brodney, MABeck, EMButler, CRZhang, LO Neill, BTBarreiro, GLaChapelle, EARogers, BN 2-amino 6-methyl-4,4a,5,6-tetrahydropyrano[3,4-d][1,3]thiazin-8a(8H)-yl-1,3-thiazol-4-yl amides US Patent US9744173 Publication Date 8/29/2017
 
Beta-secretase 1
Name:Beta-secretase 1
Type:Protein
Mol. Mass.:55755.10
Organism:Homo sapiens (Human)
Description:P56817
Residue:501
BDBM223384
NameBDBM223384
Synonyms:US9315520, 99 US9744173, Example 99
TypeSmall organic molecule
Emp. Form.C18H18ClF2N5O3S2
Mol. Mass.489.947
SMILESC[C@H]1C[C@H]2CSC(N)=N[C@]2(CO1)c1nc(NC(=O)c2ncc(OC(F)F)cc2Cl)cs1