Reaction Details
TargetBeta-secretase 1
LigandBDBM336608
Substrate/Competitorn/a
Meas. Tech.Cell-Free Assay
IC50 19.0±n/a nM
Citation Brodney, MABeck, EMButler, CRZhang, LO Neill, BTBarreiro, GLaChapelle, EARogers, BN 2-amino 6-methyl-4,4a,5,6-tetrahydropyrano[3,4-d][1,3]thiazin-8a(8H)-yl-1,3-thiazol-4-yl amides US Patent US9744173 Publication Date 8/29/2017
 
Beta-secretase 1
Name:Beta-secretase 1
Type:Protein
Mol. Mass.:55755.10
Organism:Homo sapiens (Human)
Description:P56817
Residue:501
BDBM336608
NameBDBM336608
Synonyms:US9744173, Comparator 5
TypeSmall organic molecule
Emp. Form.C19H21N5O2S2
Mol. Mass.415.532
SMILESC[C@H]1C[C@H]2CSC(N)N[C@]2(CO1)c1cc(NC(=O)c2ccc(cn2)C#N)cs1