Reaction Details
TargetIntegrin alpha-IIb
LigandBDBM228625
Substrate/Competitorn/a
Meas. Tech.Enzyme Assay
IC50 16.0±n/a nM
Citation Berger, MKruger, MLohrke, JReinhardt, MSiebeneicher, H Compounds for binding to the platelet specific glycoprotein IIb/IIIa and their use for imaging of thrombi US Patent US9744252 Publication Date 8/29/2017
 
Integrin alpha-IIb
Name:Integrin alpha-IIb
Type:Protein
Mol. Mass.:113354.85
Organism:Homo sapiens (Human)
Description:P08514
Residue:1039
BDBM228625
NameBDBM228625
Synonyms:US9345793, 6 | US9744252, Example 6
TypeSmall organic molecule
Emp. Form.C30H39FN4O5
Mol. Mass.554.6529
SMILESOC(=O)C[C@H](NC(=O)[C@@H]1CCCN(C1)C(=O)CCC1CCNCC1)c1cncc(c1)-c1cccc(OCCF)c1