Reaction Details
TargetAcetylcholinesterase
LigandBDBM13543
Substrate/CompetitorBDBM8959
Meas. Tech.Cholinesterase Inhibition Assay
Ki 3.23±n/a nM
IC50 3.25±n/a nM
Citation Elsinghorst, PWTanarro, CMGutschow, M Novel heterobivalent tacrine derivatives as cholinesterase inhibitors with notable selectivity toward butyrylcholinesterase. J Med Chem49:7540-4 (2006) 
 
Acetylcholinesterase
Name:Acetylcholinesterase
Type:Enzyme
Mol. Mass.:71812.79
Organism:Electrophorus electricus (Electric eel)
Description:n/a
Residue:633
BDBM13543
BDBM8959
NameBDBM13543
Synonyms:3,4,5-Trimethoxy-N-(8-oxo-8-(2-(1,2,3,4-tetrahydroacridin-9-yl)hydrazino)octyl)-benzamide tacrine derivative 15h
TypeSmall organic molecule
Emp. Form.C31H40N4O5
Mol. Mass.548.6731
SMILESCOc1cc(cc(OC)c1OC)C(=O)NCCCCCCCC(=O)NNc1c2CCCCc2nc2ccccc12