Reaction Details
TargetCoagulation factor VII
LigandBDBM13555
Substrate/CompetitorBDBM13553
Meas. Tech.Serine Protease Inhibition Assay
pH7.8±n/a
Temperature295.15±n/a K
Ki 7±n/a nM
Citation Zbinden, KGObst-Sander, UHilpert, KKuhne, HBanner, DWBohm, HJStahl, MAckermann, JAlig, LWeber, LWessel, HPRiederer, MATschopp, TBLave, T Selective and orally bioavailable phenylglycine tissue factor/factor VIIa inhibitors. Bioorg Med Chem Lett15:5344-52 (2005) 
 
Coagulation factor VII
Name:Coagulation factor VII
Type:Enzyme
Mol. Mass.:51599.89
Organism:Homo sapiens (Human)
Description:n/a
Residue:466
BDBM13555
BDBM13553
NameBDBM13555
Synonyms:(2S)-2-{2-[4-(benzyloxy)-5-methoxy-2-(2-phenylacetyl)phenyl]-2-[(4-carbamimidoylphenyl)amino]acetamido}-2-phenylacetic acid phenylglycine deriv. 3
TypeSmall organic molecule
Emp. Form.C39H36N4O6
Mol. Mass.656.7263
SMILESCOc1cc(C(Nc2ccc(cc2)C(N)=N)C(=O)N[C@H](C(O)=O)c2ccccc2)c(cc1OCc1ccccc1)C(=O)Cc1ccccc1