Reaction Details
TargetMethylosome protein 50/Protein arginine N-methyltransferase 5
LigandBDBM337151
Substrate/Competitorn/a
Meas. Tech.Enzyme Assay
IC50<100±n/a nM
Citation Duncan, KWChesworth, RBoriack-Sjodin, PAMunchhof, MJJin, L PRMT5 inhibitors containing a dihydro- or tetrahydroisoquinoline and uses thereof US Patent US9745291 Publication Date 8/29/2017
 
Methylosome protein 50/Protein arginine N-methyltransferase 5
Name:Methylosome protein 50/Protein arginine N-methyltransferase 5
Type:Protein
Mol. Mass.:n/a
Description:n/a
Components:This complex has 2 components.
Component 1
Name:Protein arginine N-methyltransferase 5
Synonyms:72 kDa ICln-binding protein HRMT1L5 IBP72 Jak-binding protein 1 PRMT5/MEP50 complex Protein arginine methyltransferase 5 (PRMT5) SKB1 homolog Shk1 kinase-binding protein 1 homolog
Type:Enzyme
Mol. Mass.:72679.99
Organism:Homo sapiens (Human)
Description:O14744
Residue:637
Component 2
Name:Methylosome protein 50
Synonyms:Androgen receptor cofactor p44 MEP50 Nbla10071 WD45 p44/Mep50
Type:Enzyme
Mol. Mass.:36713.38
Organism:Homo sapiens (Human)
Description:Q9BQA1
Residue:342
BDBM337151
NameBDBM337151
Synonyms:US9745291, Compound 197
TypeSmall organic molecule
Emp. Form.C24H32N4O3
Mol. Mass.424.5359
SMILESO[C@H](CNC(=O)COc1cccc(c1)N1CCNCC1)CN1CCc2ccccc2C1