Reaction Details
TargetProthrombin
LigandBDBM13642
Substrate/CompetitorBDBM13573
Meas. Tech.Thrombin Inhibition Assay
Ki 4866±n/a nM
Citation Matter, HWill, DWNazare, MSchreuder, HLaux, VWehner, V Structural requirements for factor Xa inhibition by 3-oxybenzamides with neutral P1 substituents: combining X-ray crystallography, 3D-QSAR, and tailored scoring functions. J Med Chem48:3290-312 (2005) 
 
Prothrombin
Name:Prothrombin
Type:Protein
Mol. Mass.:70029.57
Organism:Homo sapiens (Human)
Description:P00734
Residue:622
BDBM13642
BDBM13573
NameBDBM13642
Synonyms:3-Oxybenzamide 28 | 3-[2-(2,4-dichlorophenyl)ethoxy]-4-methyl-N-{[1-(pyridin-4-yl)piperidin-4-yl]methyl}benzamide
TypeSmall organic molecule
Emp. Form.C27H29Cl2N3O2
Mol. Mass.498.444
SMILESCc1ccc(cc1OCCc1ccc(Cl)cc1Cl)C(=O)NCC1CCN(CC1)c1ccncc1