Reaction Details
TargetCoagulation factor X
LigandBDBM13670
Substrate/CompetitorBDBM12500
Meas. Tech.Factor Xa Inhibition Assay
Ki 25±n/a nM
Citation Matter, HWill, DWNazare, MSchreuder, HLaux, VWehner, V Structural requirements for factor Xa inhibition by 3-oxybenzamides with neutral P1 substituents: combining X-ray crystallography, 3D-QSAR, and tailored scoring functions. J Med Chem48:3290-312 (2005) 
 
Coagulation factor X
Name:Coagulation factor X
Type:Enzyme
Mol. Mass.:54726.60
Organism:Homo sapiens (Human)
Description:n/a
Residue:488
BDBM13670
BDBM12500
NameBDBM13670
Synonyms:3-Oxybenzamide 56 | 4-chloro-3-[2-(4-chlorophenyl)ethoxy]-5-methoxy-N-{[1-(pyridin-4-yl)piperidin-4-yl]methyl}benzamide
TypeSmall organic molecule
Emp. Form.C27H29Cl2N3O3
Mol. Mass.514.443
SMILESCOc1cc(cc(OCCc2ccc(Cl)cc2)c1Cl)C(=O)NCC1CCN(CC1)c1ccncc1