Reaction Details
TargetD(1A) dopamine receptor
LigandBDBM337365
Substrate/Competitorn/a
Meas. Tech.Binding Assay
Ki 52.0±n/a nM
Citation Gray, DLZhang, LBrodney, MADavoren, JEEfremov, IVGreen, MEO Neil, SVRogers, BN Heterocyclic compounds and their use as dopamine D1 ligands US Patent US9745317 Publication Date 8/29/2017
 
D(1A) dopamine receptor
Name:D(1A) dopamine receptor
Type:Enzyme
Mol. Mass.:49303.43
Organism:Homo sapiens (Human)
Description:P21728
Residue:446
BDBM337365
NameBDBM337365
Synonyms:5-[4-(2,3-Dihydrofuro[3,2-c]pyridin-4-yloxy)phenyl]-4,6-dimethylpyridazin-3(2H)-one (3) | US9745317, 3
TypeSmall organic molecule
Emp. Form.C39H32OP2
Mol. Mass.578.6183
SMILESCC1(C)c2cccc(P(c3ccccc3)c3ccccc3)c2Oc2c(cccc12)P(c1ccccc1)c1ccccc1